$ cargo test --workspace # cwd /Users/king/Desktop/Workspace/SRO/zoen # exit 101 running 7 tests test tests::movement_stays_inside_the_region ... ok test tests::a_full_event_buffer_counts_instead_of_growing ... ok test tests::config_converts_data_to_integer_units ... ok test tests::fnv1a64_known_answers ... ok test tests::only_the_direction_counts ... ok test tests::sequence_rules ... ok test tests::replaying_the_same_inputs_gives_the_same_hashes ... FAILED failures: ---- tests::replaying_the_same_inputs_gives_the_same_hashes stdout ---- thread 'tests::replaying_the_same_inputs_gives_the_same_hashes' (4237690) panicked at crates/zoen-sim/src/lib.rs:399:56: attempt to multiply with overflow note: run with `RUST_BACKTRACE=1` environment variable to display a backtrace failures: tests::replaying_the_same_inputs_gives_the_same_hashes test result: FAILED. 6 passed; 1 failed; 0 ignored; 0 measured; 0 filtered out; finished in 0.00s Compiling zoen-sim-tools v0.1.0 (/Users/king/Desktop/Workspace/SRO/zoen/crates/zoen-sim-tools) Compiling zoen-sim v0.1.0 (/Users/king/Desktop/Workspace/SRO/zoen/crates/zoen-sim) Finished `test` profile [unoptimized + debuginfo] target(s) in 0.38s Running unittests src/lib.rs (target/debug/deps/zoen_sim-1c5c0d2bde286b8b) error: test failed, to rerun pass `-p zoen-sim --lib`